Target
Protein cereblon
Ligand
BDBM50549804
Substrate
Meas. Tech.
ChEMBL_2025843 (CHEMBL4679656)
Ki
216000±n/a nM
Citation
 Maiwald, SHeim, CHernandez Alvarez, BHartmann, MD Sweet and Blind Spots in E3 Ligase Ligand Space Revealed by a Thermophoresis-Based Assay. ACS Med Chem Lett 12:74-81 (2021)  
Target
Name:
Protein cereblon
Synonyms:
CRBN | CRBN_HUMAN
Type:
PROTEIN
Mol. Mass.:
50537.73
Organism:
Homo sapiens (Human)
Description:
ChEMBL_116917
Residue:
442
  
Inhibitor
Name:
BDBM50549804
Synonyms:
CHEBI:27612 Imidazolidine-2,4-Dione
Type:
Small organic molecule
Emp. Form.:
C3H4N2O2
Mol. Mass.:
100.0761
SMILES:
O=C1CNC(=O)N1
: