Target
Protein cereblon
Ligand
BDBM50549806
Substrate
Meas. Tech.
ChEMBL_2025843 (CHEMBL4679656)
Ki
67800±n/a nM
Citation
 Maiwald, SHeim, CHernandez Alvarez, BHartmann, MD Sweet and Blind Spots in E3 Ligase Ligand Space Revealed by a Thermophoresis-Based Assay. ACS Med Chem Lett 12:74-81 (2021)  
Target
Name:
Protein cereblon
Synonyms:
CRBN | CRBN_HUMAN
Type:
PROTEIN
Mol. Mass.:
50537.73
Organism:
Homo sapiens (Human)
Description:
ChEMBL_116917
Residue:
442
  
Inhibitor
Name:
BDBM50549806
Synonyms:
CHEMBL4758352
Type:
Small organic molecule
Emp. Form.:
C4H6N2O2
Mol. Mass.:
114.1026
SMILES:
CN1CC(=O)NC1=O
: