Target
Protein cereblon
Ligand
BDBM50088517
Substrate
Meas. Tech.
ChEMBL_2025843 (CHEMBL4679656)
Ki
390000±n/a nM
Citation
 Maiwald, SHeim, CHernandez Alvarez, BHartmann, MD Sweet and Blind Spots in E3 Ligase Ligand Space Revealed by a Thermophoresis-Based Assay. ACS Med Chem Lett 12:74-81 (2021)  
Target
Name:
Protein cereblon
Synonyms:
CRBN | CRBN_HUMAN
Type:
PROTEIN
Mol. Mass.:
50537.73
Organism:
Homo sapiens (Human)
Description:
ChEMBL_116917
Residue:
442
  
Inhibitor
Name:
BDBM50088517
Synonyms:
CHEBI:16704 | Uridine
Type:
Small organic molecule
Emp. Form.:
C9H12N2O6
Mol. Mass.:
244.2014
SMILES:
OC[C@H]1O[C@H]([C@H](O)[C@@H]1O)n1ccc(=O)[nH]c1=O
: