Target
Protein cereblon
Ligand
BDBM76986
Substrate
Meas. Tech.
ChEMBL_2025843 (CHEMBL4679656)
Ki
16700±n/a nM
Citation
 Maiwald, SHeim, CHernandez Alvarez, BHartmann, MD Sweet and Blind Spots in E3 Ligase Ligand Space Revealed by a Thermophoresis-Based Assay. ACS Med Chem Lett 12:74-81 (2021)  
Target
Name:
Protein cereblon
Synonyms:
CRBN | CRBN_HUMAN
Type:
PROTEIN
Mol. Mass.:
50537.73
Organism:
Homo sapiens (Human)
Description:
ChEMBL_116917
Residue:
442
  
Inhibitor
Name:
BDBM76986
Synonyms:
3-(5-amino-2-methyl-4-oxo-4H-quinazolin-3-yl)-piperidine-2,6-dione US9694015, Compound A
Type:
Small organic molecule
Emp. Form.:
C14H14N4O3
Mol. Mass.:
286.286
SMILES:
Cc1nc2cccc(N)c2c(=O)n1C1CCC(=O)NC1=O
: