Target
Sulfotransferase 1E1
Ligand
BDBM50109104
Substrate
Meas. Tech.
ChEMBL_67843 (CHEMBL679631)
IC50
3000±n/a nM
Citation
 Kehoe, JWMaly, DJVerdugo, DEArmstrong, JICook, BNOuyang, YBMoore, KLEllman, JABertozzi, CR Tyrosylprotein sulfotransferase inhibitors generated by combinatorial target-guided ligand assembly. Bioorg Med Chem Lett 12:329-32 (2002)  
Target
Name:
Sulfotransferase 1E1
Synonyms:
Estrogen sulfotransferase STE | SULT1E1
Type:
PROTEIN
Mol. Mass.:
35126.48
Organism:
Homo sapiens (Human)
Description:
ChEMBL_67842
Residue:
294
  
Inhibitor
Name:
BDBM50109104
Synonyms:
6,8-Dichloro-4-oxo-4H-chromene-3-carbaldehyde O-{5-[1-(5-bromo-2-hydroxy-3-nitro-phenyl)-meth-(E)-ylideneaminooxy]-pentyl}-oxime | CHEMBL113219
Type:
Small organic molecule
Emp. Form.:
C22H18BrCl2N3O7
Mol. Mass.:
587.204
SMILES:
Oc1c([CH+][N-]OCCCCCO[N-][CH+]c2coc3c(Cl)cc(Cl)cc3c2=O)cc(Br)cc1[N+]([O-])=O
: