Target
Sulfotransferase 1E1
Ligand
BDBM50109107
Substrate
Meas. Tech.
ChEBML_67842
IC50
250±n/a nM
Citation
 Kehoe, JWMaly, DJVerdugo, DEArmstrong, JICook, BNOuyang, YBMoore, KLEllman, JABertozzi, CR Tyrosylprotein sulfotransferase inhibitors generated by combinatorial target-guided ligand assembly. Bioorg Med Chem Lett 12:329-32 (2002)  
Target
Name:
Sulfotransferase 1E1
Synonyms:
Estrogen sulfotransferase STE | SULT1E1
Type:
PROTEIN
Mol. Mass.:
35126.48
Organism:
Homo sapiens (Human)
Description:
ChEMBL_67842
Residue:
294
  
Inhibitor
Name:
BDBM50109107
Synonyms:
6,8-Dichloro-4-oxo-4H-chromene-3-carbaldehyde O-{5-[1-(3,5-dibromo-4-hydroxy-phenyl)-meth-(E)-ylideneaminooxy]-pentyl}-oxime | CHEMBL112118
Type:
Small organic molecule
Emp. Form.:
C22H18Br2Cl2N2O5
Mol. Mass.:
621.103
SMILES:
Oc1c(Br)cc(\C=N\OCCCCCO\N=C\c2coc3c(Cl)cc(Cl)cc3c2=O)cc1Br
: