Target
Muscarinic acetylcholine receptor M2
Ligand
BDBM50366775
Substrate
Meas. Tech.
ChEMBL_2026001 (CHEMBL4679814)
IC50
63±n/a nM
Citation
 Schrader, TOXiong, YLorenzana, AOBroadhead, AStebbins, KJPoon, MMBaccei, CLorrain, DS Discovery of PIPE-359, a Brain-Penetrant, Selective M ACS Med Chem Lett 12:155-161 (2021)  
Target
Name:
Muscarinic acetylcholine receptor M2
Synonyms:
ACM2_HUMAN Cholinergic, muscarinic M2 Muscarinic acetylcholine receptor M2 and M5 | RecName: Full=Muscarinic acetylcholine receptor M2
Type:
GPCR
Mol. Mass.:
51730.61
Organism:
Homo sapiens (Human)
Description:
P08172
Residue:
466
  
Inhibitor
Name:
BDBM50366775
Synonyms:
BENZTROPINE | Benzatropine
Type:
Small organic molecule
Emp. Form.:
C21H25NO
Mol. Mass.:
307.4293
SMILES:
CN1[C@H]2CC[C@@H]1C[C@@H](C2)OC(c1ccccc1)c1ccccc1
: