Target
Adenosine receptor A3
Ligand
BDBM50109474
Substrate
Meas. Tech.
ChEMBL_32188 (CHEMBL648968)
Ki
0.8±n/a nM
Citation
 Baraldi, PGCacciari, BMoro, SSpalluto, GPastorin, GDa Ros, TKlotz, KNVarani, KGessi, SBorea, PA Synthesis, biological activity, and molecular modeling investigation of new pyrazolo[4,3-e]-1,2,4-triazolo[1,5-c]pyrimidine derivatives as human A(3) adenosine receptor antagonists. J Med Chem 45:770-80 (2002)  
Target
Name:
Adenosine receptor A3
Synonyms:
A3 adenosine receptor (hA3) ADORA3 | Adenosine A3 receptor (A3AR)
Type:
G Protein-Coupled Receptor (GPCR)
Mol. Mass.:
36197.32
Organism:
Homo sapiens (Human)
Description:
P0DMS8
Residue:
318
  
Inhibitor
Name:
BDBM50109474
Synonyms:
1-(2-(furan-2-yl)-8-methyl-8H-pyrazolo[4,3-e][1,2,4]triazolo[1,5-c]pyrimidin-5-yl)-3-(3-methoxyphenyl)urea CHEMBL164992
Type:
Small organic molecule
Emp. Form.:
C19H16N8O3
Mol. Mass.:
404.3821
SMILES:
COc1cccc(NC(=O)Nc2nc3nn(C)cc3c3nc(nn23)-c2ccco2)c1
: