Target
Adenosine receptor A2a
Ligand
BDBM50109434
Substrate
Meas. Tech.
ChEMBL_31652 (CHEMBL648828)
Ki
120±n/a nM
Citation
 Baraldi, PGCacciari, BMoro, SSpalluto, GPastorin, GDa Ros, TKlotz, KNVarani, KGessi, SBorea, PA Synthesis, biological activity, and molecular modeling investigation of new pyrazolo[4,3-e]-1,2,4-triazolo[1,5-c]pyrimidine derivatives as human A(3) adenosine receptor antagonists. J Med Chem 45:770-80 (2002)  
Target
Name:
Adenosine receptor A2a
Synonyms:
A2A adenosine receptor (hA2A) ADENOSINE A2 ADORA2 Adenosine A2A receptor (A2AAR)
Type:
G Protein-Coupled Receptor (GPCR)
Mol. Mass.:
44716.46
Organism:
Homo sapiens (Human)
Description:
P29274
Residue:
412
  
Inhibitor
Name:
BDBM50109434
Synonyms:
1-(4-Fluoro-phenyl)-3-(2-furan-2-yl-8-methyl-8H-pyrazolo[4,3-e][1,2,4]triazolo[1,5-c]pyrimidin-5-yl)-urea CHEMBL572765
Type:
Small organic molecule
Emp. Form.:
C18H13FN8O2
Mol. Mass.:
392.3466
SMILES:
Cn1cc2c(n1)nc(NC(=O)Nc1ccc(F)cc1)n1nc(nc21)-c1ccco1
: