Target
Adenosine receptor A3
Ligand
BDBM50109466
Substrate
Meas. Tech.
ChEMBL_29871 (CHEMBL645883)
Ki
0.86±n/a nM
Citation
 Baraldi, PGCacciari, BMoro, SSpalluto, GPastorin, GDa Ros, TKlotz, KNVarani, KGessi, SBorea, PA Synthesis, biological activity, and molecular modeling investigation of new pyrazolo[4,3-e]-1,2,4-triazolo[1,5-c]pyrimidine derivatives as human A(3) adenosine receptor antagonists. J Med Chem 45:770-80 (2002)  
Target
Name:
Adenosine receptor A3
Synonyms:
A3 adenosine receptor (hA3) ADORA3 | Adenosine A3 receptor (A3AR)
Type:
G Protein-Coupled Receptor (GPCR)
Mol. Mass.:
36197.32
Organism:
Homo sapiens (Human)
Description:
P0DMS8
Residue:
318
  
Inhibitor
Name:
BDBM50109466
Synonyms:
1-(8-Ethyl-2-furan-2-yl-8H-pyrazolo[4,3-e][1,2,4]triazolo[1,5-c]pyrimidin-5-yl)-3-(3-methoxy-phenyl)-urea CHEMBL164381
Type:
Small organic molecule
Emp. Form.:
C20H18N8O3
Mol. Mass.:
418.4087
SMILES:
CCn1cc2c(n1)nc(NC(=O)Nc1cccc(OC)c1)n1nc(nc21)-c1ccco1
: