Target
Adenosine receptor A3
Ligand
BDBM50109487
Substrate
Meas. Tech.
ChEMBL_32181 (CHEMBL647242)
Ki
0.7±n/a nM
Citation
 Baraldi, PGCacciari, BMoro, SSpalluto, GPastorin, GDa Ros, TKlotz, KNVarani, KGessi, SBorea, PA Synthesis, biological activity, and molecular modeling investigation of new pyrazolo[4,3-e]-1,2,4-triazolo[1,5-c]pyrimidine derivatives as human A(3) adenosine receptor antagonists. J Med Chem 45:770-80 (2002)  
Target
Name:
Adenosine receptor A3
Synonyms:
A3 adenosine receptor (hA3) ADORA3 | Adenosine A3 receptor (A3AR)
Type:
G Protein-Coupled Receptor (GPCR)
Mol. Mass.:
36197.32
Organism:
Homo sapiens (Human)
Description:
P0DMS8
Residue:
318
  
Inhibitor
Name:
BDBM50109487
Synonyms:
1-(2-(furan-2-yl)-8-methyl-8H-pyrazolo[4,3-e][1,2,4]triazolo[1,5-c]pyrimidin-5-yl)-3-(2-methoxyphenyl)urea CHEMBL351211
Type:
Small organic molecule
Emp. Form.:
C19H16N8O3
Mol. Mass.:
404.3821
SMILES:
COc1ccccc1NC(=O)Nc1nc2nn(C)cc2c2nc(nn12)-c1ccco1
: