Target
Leucine--tRNA ligase, cytoplasmic
Ligand
BDBM50458119
Substrate
Meas. Tech.
ChEMBL_2027510 (CHEMBL4681668)
IC50
22±n/a nM
Citation
 Yoon, SKim, JHKim, SEKim, CTran, PTAnn, JKoh, YJang, JKim, SMoon, HSKim, WKLee, SLee, JKim, SLee, J Discovery of Leucyladenylate Sulfamates as Novel Leucyl-tRNA Synthetase (LRS)-Targeted Mammalian Target of Rapamycin Complex 1 (mTORC1) Inhibitors. J Med Chem 59:10322-10328 (2016)  
Target
Name:
Leucine--tRNA ligase, cytoplasmic
Synonyms:
KIAA1352 LARS1 SYLC_HUMAN
Type:
PROTEIN
Mol. Mass.:
134475.20
Organism:
Homo sapiens (Human)
Description:
ChEMBL_98544
Residue:
1176
  
Inhibitor
Name:
BDBM50458119
Synonyms:
Leusa
Type:
Small organic molecule
Emp. Form.:
C16H25N7O7S
Mol. Mass.:
459.477
SMILES:
CC(C)C[C@H](N)C(=O)NS(=O)(=O)OC[C@H]1O[C@H]([C@H](O)[C@@H]1O)n1cnc2c(N)ncnc12
: