Target
Nicotinic acetylcholine receptor alpha9/alpha10
Ligand
BDBM50550633
Substrate
Meas. Tech.
ChEMBL_2027936 (CHEMBL4682094)
IC50
875±n/a nM
Citation
 Cai, FXu, NLiu, ZDing, RYu, SDong, MWang, SShen, JTae, HSAdams, DJZhang, XDai, Q Targeting of N-Type Calcium Channels via GABA J Med Chem 61:10198-10205 (2018)  
Target
Name:
Nicotinic acetylcholine receptor alpha9/alpha10
Synonyms:
Neuronal acetylcholine receptor subunit alpha-10/alpha-9
Type:
Mol. Mass.:
Description:
ASSAY_ID of ChEMBL is 2193071
Components:
This complex has 2 components.
Component 1
Name:
Neuronal acetylcholine receptor subunit alpha-9
Synonyms:
ACHA9_RAT Cholinergic, Nicotinic Muscle NACHR alpha 9 Nicotinic acetylcholine receptor subunit alpha 9
Type:
Enzyme Catalytic Domain
Mol. Mass.:
54522.69
Organism:
RAT
Description:
Cholinergic, Nicotinic Muscle 0 RAT::P43144
Residue:
479
  
Component 2
Name:
Neuronal acetylcholine receptor subunit alpha-10
Synonyms:
ACH10_RAT Neuronal acetylcholine receptor protein alpha-10 subunit | Nicotinic acetylcholine receptor alpha9/alpha10
Type:
PROTEIN
Mol. Mass.:
49830.54
Organism:
Rattus norvegicus
Description:
ChEMBL_143222
Residue:
447
  
Inhibitor
Name:
BDBM50550633
Synonyms:
CHEMBL4763515
Type:
Small organic molecule
Emp. Form.:
C80H117N25O25S4
Mol. Mass.:
1957.197
SMILES:
CC[C@H](C)[C@H](NC(=O)[C@H](CCC(O)=O)NC(=O)[C@@H]1CCCN1C(=O)[C@H](Cc1cnc[nH]1)NC(=O)[C@H](CC(O)=O)NC(=O)[C@H](Cc1ccc(O)cc1)NC(=O)[C@H](CCCNC(N)=N)NC(=O)[C@H](CS)NC(=O)[C@H](CCCNC(N)=N)NC(=O)[C@@H]1CCCN1C(=O)[C@H](CC(O)=O)NC(=O)[C@H](CO)NC(=O)[C@H](CS)NC(=O)[C@H](CS)NC(=O)CNC(=O)c1ccccc1)C(=O)N[C@@H](CS)C(N)=O
: