Target
Serine-protein kinase ATM
Ligand
BDBM50550687
Substrate
Meas. Tech.
ChEMBL_2028066 (CHEMBL4682224)
IC50
0.500000±n/a nM
Citation
 Toledo-Sherman, LBreccia, PCachope, RBate, JRAngulo-Herrera, IWishart, GMatthews, KLMartin, SLCox, HCMcAllister, GPenrose, SDVater, HEsmieu, WVan de Poël, AVan de Bospoort, RStrijbosch, ALamers, MLeonard, PJarvis, REBlackaby, WBarnes, KEznarriaga, MDowler, SSmith, GDFischer, DFLazari, OYates, DRose, MJang, SWMuñoz-Sanjuan, IDominguez, C Optimization of Potent and Selective Ataxia Telangiectasia-Mutated Inhibitors Suitable for a Proof-of-Concept Study in Huntington's Disease Models. J Med Chem 62:2988-3008 (2019)  
Target
Name:
Serine-protein kinase ATM
Synonyms:
A-T mutated ATM_HUMAN | Ataxia telangiectasia mutated
Type:
Protein
Mol. Mass.:
350696.72
Organism:
Homo sapiens (Human)
Description:
Q13315
Residue:
3056
  
Inhibitor
Name:
BDBM50550687
Synonyms:
CHEMBL4781601
Type:
Small organic molecule
Emp. Form.:
C28H29NO5S
Mol. Mass.:
491.599
SMILES:
O=c1cc(oc(c1)-c1cccc2Cc3cc(OCC4CCOCC4)ccc3Sc12)N1CCOCC1
: