Target
Adenosine receptor A2a
Ligand
BDBM50493145
Substrate
Meas. Tech.
ChEMBL_2028570 (CHEMBL4682728)
Ki
0.004200±n/a nM
Citation
 Abdelrahman, AYerande, SGNamasivayam, VKlapschinski, TAAlnouri, MWEl-Tayeb, AMüller, CE Substituted 4-phenylthiazoles: Development of potent and selective A Eur J Med Chem 186:0 (2020)  
Target
Name:
Adenosine receptor A2a
Synonyms:
A2A adenosine receptor (hA2A) ADENOSINE A2 ADORA2 Adenosine A2A receptor (A2AAR)
Type:
G Protein-Coupled Receptor (GPCR)
Mol. Mass.:
44716.46
Organism:
Homo sapiens (Human)
Description:
P29274
Residue:
412
  
Inhibitor
Name:
BDBM50493145
Synonyms:
CHEMBL2419149
Type:
Small organic molecule
Emp. Form.:
C17H10BrN3S2
Mol. Mass.:
400.315
SMILES:
Brc1ccc(\C=N\c2c(sc(=S)n2-c2ccccc2)C#N)cc1
: