Target
Adenosine receptor A2b
Ligand
BDBM82053
Substrate
Meas. Tech.
ChEMBL_2028572 (CHEMBL4682730)
Ki
9070±n/a nM
Citation
 Abdelrahman, AYerande, SGNamasivayam, VKlapschinski, TAAlnouri, MWEl-Tayeb, AMüller, CE Substituted 4-phenylthiazoles: Development of potent and selective A Eur J Med Chem 186:0 (2020)  
Target
Name:
Adenosine receptor A2b
Synonyms:
AA2BR_HUMAN ADORA2B Adenosine receptors A2b | Adenosine receptors; A2a & A2b
Type:
G Protein-Coupled Receptor (GPCR)
Mol. Mass.:
36341.22
Organism:
Homo sapiens (Human)
Description:
Residue:
332
  
Inhibitor
Name:
BDBM82053
Synonyms:
8-(2-Furyl)theophylline US9144538, Theophylline
Type:
Emp. Form.:
C7H8N4O2
Mol. Mass.:
180.164
SMILES:
Cn1c2[nH]cnc2c(=O)n(C)c1=O
: