Target
DNA topoisomerase 4 subunit B
Ligand
BDBM50226181
Substrate
Meas. Tech.
ChEMBL_2029136 (CHEMBL4683294)
IC50
7900±n/a nM
Citation
 Xue, WLi, XMa, GZhang, HChen, YKirchmair, JXia, JWu, S N-thiadiazole-4-hydroxy-2-quinolone-3-carboxamides bearing heteroaromatic rings as novel antibacterial agents: Design, synthesis, biological evaluation and target identification. Eur J Med Chem 188:0 (2020)  
Target
Name:
DNA topoisomerase 4 subunit B
Synonyms:
DNA topoisomerase 4 subunit B PARE_STAA8 grlB | parE
Type:
Enzyme
Mol. Mass.:
74365.92
Organism:
Staphylococcus aureus
Description:
Q2FYS5
Residue:
663
  
Inhibitor
Name:
BDBM50226181
Synonyms:
(3R,4S,5R,6R)-5-hydroxy-6-(4-hydroxy-3-(4-hydroxy-3-(3-methylbut-2-enyl)benzamido)-2-oxo-2H-chromen-7-yloxy)-3-methoxy-2,2-dimethyl-tetrahydro-2H-pyran-4-yl carbamate CHEMBL36506 Carbamic acid (3R,4S,5R,6R)-5-hydroxy-6-{4-hydroxy-3-[4-hydroxy-3-(4-methyl-pent-3-enyl)-benzoylamino]-8-methyl-2-oxo-2H-chromen-7-yloxy}-3-methoxy-2,2-dimethyl-tetrahydro-pyran-4-yl ester Carbamic acid 5-hydroxy-6-{4-hydroxy-3-[4-hydroxy-3-(3-methyl-but-2-enyl)-benzoylamino]-8-methyl-2-oxo-2H-chromen-7-yloxy}-3-methoxy-2,2-dimethyl-tetrahydro-pyran-4-yl ester(Novobiocin) | NOVOBIOCIN
Type:
Small organic molecule
Emp. Form.:
C31H36N2O11
Mol. Mass.:
612.6243
SMILES:
[#6]-[#8]-[#6@@H]1-[#6@@H](-[#8]-[#6](-[#7])=O)-[#6@@H](-[#8])-[#6@H](-[#8]-c2ccc3c(-[#8])c(-[#7]-[#6](=O)-c4ccc(-[#8])c(-[#6]\[#6]=[#6](/[#6])-[#6])c4)c(=O)oc3c2-[#6])-[#8]C1([#6])[#6]
: