Target
Protein arginine N-methyltransferase 3
Ligand
BDBM50009672
Substrate
Meas. Tech.
ChEMBL_2030361 (CHEMBL4684519)
IC50
760±n/a nM
Citation
 Gibbons, GSChakraborty, AGrigsby, SMUmeano, ACLiao, CMoukha-Chafiq, OPathak, VMathew, BLee, YTDou, YSchürer, SCReynolds, RCSnowden, TSNikolovska-Coleska, Z Identification of DOT1L inhibitors by structure-based virtual screening adapted from a nucleoside-focused library. Eur J Med Chem 189:0 (2020)  
Target
Name:
Protein arginine N-methyltransferase 3
Synonyms:
2.1.1.- HRMT1L3 PRMT3 | Protein arginine N-methyltransferase 3
Type:
PROTEIN
Mol. Mass.:
59886.87
Organism:
Homo sapiens
Description:
ChEMBL_101368
Residue:
531
  
Inhibitor
Name:
BDBM50009672
Synonyms:
AdoHcy S-(5'-adenosyl)-L-homocysteine S-[1-(adenin-9-yl)-1,5-dideoxy-beta-D-ribofuranos-5-yl]-L-homocysteine SAH US9175331, 1 | US9333217, S-Adenosyl-L-homocysteine (SAH)
Type:
Small organic molecule
Emp. Form.:
C14H20N6O5S
Mol. Mass.:
384.411
SMILES:
N[C@@H](CCSC[C@H]1O[C@H]([C@H](O)[C@@H]1O)n1cnc2c(N)ncnc12)C(O)=O
: