Target
Ephrin type-A receptor 2
Ligand
BDBM50234957
Substrate
Meas. Tech.
ChEMBL_2030718 (CHEMBL4684876)
Ki
400±n/a nM
Citation
 Incerti, MRusso, SCorrado, MGiorgio, CBallabeni, VChiodelli, PRusnati, MScalvini, LCallegari, DCastelli, RVacondio, FFerlenghi, FTognolini, MLodola, A Optimization of EphA2 antagonists based on a lithocholic acid core led to the identification of UniPR505, a new 3?-carbamoyloxy derivative with antiangiogenetic properties. Eur J Med Chem 189:0 (2020)  
Target
Name:
Ephrin type-A receptor 2
Synonyms:
ECK EPHA2_HUMAN Epithelial cell kinase | Tyrosine-protein kinase receptor ECK
Type:
PROTEIN
Mol. Mass.:
108260.70
Organism:
Homo sapiens (Human)
Description:
ChEMBL_1505248
Residue:
976
  
Inhibitor
Name:
BDBM50234957
Synonyms:
CHEMBL3735125
Type:
Small organic molecule
Emp. Form.:
C36H52N2O4
Mol. Mass.:
576.8091
SMILES:
[H][C@@]1(CC[C@@]2([H])[C@]3([H])CC[C@]4([H])C[C@H](O)CC[C@]4(C)[C@@]3([H])CC[C@]12C)[C@H](C)CCC(=O)N[C@H](CC(O)=O)Cc1c[nH]c2ccccc12
: