Target
Bifunctional dihydrofolate reductase-thymidylate synthase
Ligand
BDBM18786
Substrate
Meas. Tech.
ChEMBL_155100 (CHEMBL762995)
IC50
3000±n/a nM
Citation
 Tarnchompoo, BSirichaiwat, CPhupong, WIntaraudom, CSirawaraporn, WKamchonwongpaisan, SVanichtanankul, JThebtaranonth, YYuthavong, Y Development of 2,4-diaminopyrimidines as antimalarials based on inhibition of the S108N and C59R+S108N mutants of dihydrofolate reductase from pyrimethamine-resistant Plasmodium falciparum. J Med Chem 45:1244-52 (2002)  
Target
Name:
Bifunctional dihydrofolate reductase-thymidylate synthase
Synonyms:
DHFR-TS Dihydrofolate Reductase-Thymidylate Synthase (DHFR-TS) Mutant KICB1 PfDHFR-TS double mutant (C59R+S108N)
Type:
Enzyme
Mol. Mass.:
71822.51
Organism:
Plasmodium falciparum (isolate K1 / Thailand)
Description:
The mutant clone was prepared by cassette mutagenesis using wildtype pfDHFR as a template, and expressed in E. coli.
Residue:
608
  
Inhibitor
Name:
BDBM18786
Synonyms:
5-(3-chlorophenyl)-6-(3-phenylpropyl)pyrimidine-2,4-diamine P31
Type:
Small organic molecule
Emp. Form.:
C19H19ClN4
Mol. Mass.:
338.834
SMILES:
Nc1nc(N)c(c(CCCc2ccccc2)n1)-c1cccc(Cl)c1
: