Target
Prostate-specific antigen
Ligand
BDBM50551467
Substrate
Meas. Tech.
ChEMBL_2031519 (CHEMBL4685677)
IC50
1400±n/a nM
Citation
 Tang, QFu, WZhang, MWang, EShan, LChai, XPang, JWang, XXu, XXu, LLi, DSheng, RHou, T Novel androgen receptor antagonist identified by structure-based virtual screening, structural optimization, and biological evaluation. Eur J Med Chem 192:0 (2020)  
Target
Name:
Prostate-specific antigen
Synonyms:
APS KLK3 Kallikrein-3 PSA Prostate-specific antigen Seminin
Type:
PROTEIN
Mol. Mass.:
28747.53
Organism:
Homo sapiens (Human)
Description:
ChEMBL_959198
Residue:
261
  
Inhibitor
Name:
BDBM50551467
Synonyms:
CHEMBL4797715
Type:
Small organic molecule
Emp. Form.:
C22H18ClN
Mol. Mass.:
331.838
SMILES:
Clc1ccccc1C1Nc2ccc3ccccc3c2C2C=CCC12
: