Target
Prostate-specific antigen
Ligand
BDBM50425732
Substrate
Meas. Tech.
ChEMBL_2031519 (CHEMBL4685677)
IC50
130±n/a nM
Citation
 Tang, QFu, WZhang, MWang, EShan, LChai, XPang, JWang, XXu, XXu, LLi, DSheng, RHou, T Novel androgen receptor antagonist identified by structure-based virtual screening, structural optimization, and biological evaluation. Eur J Med Chem 192:0 (2020)  
Target
Name:
Prostate-specific antigen
Synonyms:
APS KLK3 Kallikrein-3 PSA Prostate-specific antigen Seminin
Type:
PROTEIN
Mol. Mass.:
28747.53
Organism:
Homo sapiens (Human)
Description:
ChEMBL_959198
Residue:
261
  
Inhibitor
Name:
BDBM50425732
Synonyms:
ENZALUTAMIDE US10806720, Compound Enzalutamide US11648234, Compound Enzalutamide Xtandi
Type:
Small organic molecule
Emp. Form.:
C21H16F4N4O2S
Mol. Mass.:
464.436
SMILES:
CNC(=O)c1ccc(cc1F)N1C(=S)N(C(=O)C1(C)C)c1ccc(C#N)c(c1)C(F)(F)F
: