Target
Amyloid-beta precursor protein
Ligand
BDBM26658
Substrate
Meas. Tech.
ChEMBL_2031691 (CHEMBL4685849)
IC50
8500±n/a nM
Citation
 Tseng, HJLin, MHShiao, YJYang, YCChu, JCChen, CYChen, YYLin, TESu, CJPan, SLChen, LCWang, CYHsu, KCHuang, WJ Synthesis and biological evaluation of acridine-based histone deacetylase inhibitors as multitarget agents against Alzheimer's disease. Eur J Med Chem 192:0 (2020)  
Target
Name:
Amyloid-beta precursor protein
Synonyms:
A4 ABPP AICD-50 AICD-59 AID(57) APP Alzheimer disease amyloid protein Amyloid beta Protein Amyloid beta protein Abeta(1-42) Amyloid intracellular domain 57 Amyloid protein (Abeta42b) Beta amyloid A4 protein Beta-APP42 Beta-amyloid protein 42 C83 CVAP Gamma Secretase Gamma-CTF(57) Gamma-secretase Gamma-secretase C-terminal fragment 57 P3(40) PN-II Protease nexin-II S-APP-beta Soluble APP-beta | beta-Amyloid Precursor Protein (APP)
Type:
Single-pass type I membrane protein
Mol. Mass.:
86890.41
Organism:
Homo sapiens (Human)
Description:
P05067
Residue:
770
  
Inhibitor
Name:
BDBM26658
Synonyms:
2-(2,4-dihydroxyphenyl)-3,5,7-trihydroxy-1-benzopyran-4-one 2-(2,4-dihydroxyphenyl)-3,5,7-trihydroxy-chromone 2-[2,4-bis(oxidanyl)phenyl]-3,5,7-tris(oxidanyl)chromen-4-one MLS000069618 Morin (5) SMR000058259 morin
Type:
Flavonoid
Emp. Form.:
C15H10O7
Mol. Mass.:
302.2357
SMILES:
Oc1ccc(c(O)c1)-c1oc2cc(O)cc(O)c2c(=O)c1O
: