Target
Receptor-type tyrosine-protein kinase FLT3
Ligand
BDBM50551643
Substrate
Meas. Tech.
ChEMBL_2032151 (CHEMBL4686309)
IC50
0.150000±n/a nM
Citation
 Sellmer, APilsl, BBeyer, MPongratz, HWirth, LElz, SDove, SHenninger, SJSpiekermann, KPolzer, HKlaeger, SKuster, BBöhmer, FDFiebig, HHKrämer, OHMahboobi, S A series of novel aryl-methanone derivatives as inhibitors of FMS-like tyrosine kinase 3 (FLT3) in FLT3-ITD-positive acute myeloid leukemia. Eur J Med Chem 193:0 (2020)  
Target
Name:
Receptor-type tyrosine-protein kinase FLT3
Synonyms:
CD135 FL cytokine receptor FLK2 FLT3 Fetal liver kinase-2 Fms-like tyrosine kinase 3 (Flt-3) STK-1 Stem cell tyrosine kinase 1
Type:
Enzyme
Mol. Mass.:
112888.62
Organism:
Homo sapiens (Human)
Description:
P36888
Residue:
993
  
Inhibitor
Name:
BDBM50551643
Synonyms:
CHEMBL4790597
Type:
Small organic molecule
Emp. Form.:
C35H30N4O3
Mol. Mass.:
554.6377
SMILES:
CN([C@H]1C[C@]2(C)O[C@](C)(C1)n1c3ccccc3c3c4C(=O)NCc4c4c5ccccc5n2c4c13)C(=O)c1ccccc1
: