Target
Receptor-type tyrosine-protein kinase FLT3
Ligand
BDBM50551646
Substrate
Meas. Tech.
ChEMBL_2032151 (CHEMBL4686309)
IC50
2055±n/a nM
Citation
 Sellmer, APilsl, BBeyer, MPongratz, HWirth, LElz, SDove, SHenninger, SJSpiekermann, KPolzer, HKlaeger, SKuster, BBöhmer, FDFiebig, HHKrämer, OHMahboobi, S A series of novel aryl-methanone derivatives as inhibitors of FMS-like tyrosine kinase 3 (FLT3) in FLT3-ITD-positive acute myeloid leukemia. Eur J Med Chem 193:0 (2020)  
Target
Name:
Receptor-type tyrosine-protein kinase FLT3
Synonyms:
CD135 FL cytokine receptor FLK2 FLT3 Fetal liver kinase-2 Fms-like tyrosine kinase 3 (Flt-3) STK-1 Stem cell tyrosine kinase 1
Type:
Enzyme
Mol. Mass.:
112888.62
Organism:
Homo sapiens (Human)
Description:
P36888
Residue:
993
  
Inhibitor
Name:
BDBM50551646
Synonyms:
CHEMBL4751666
Type:
Small organic molecule
Emp. Form.:
C26H25N5O3
Mol. Mass.:
455.5084
SMILES:
Cc1cccc2[nH]c(cc12)C(=O)c1cc2ccc(NC(=O)Nc3cc(on3)C(C)(C)C)cc2[nH]1
: