Target
Receptor-type tyrosine-protein kinase FLT3
Ligand
BDBM50551648
Substrate
Meas. Tech.
ChEMBL_2032151 (CHEMBL4686309)
IC50
2075±n/a nM
Citation
 Sellmer, APilsl, BBeyer, MPongratz, HWirth, LElz, SDove, SHenninger, SJSpiekermann, KPolzer, HKlaeger, SKuster, BBöhmer, FDFiebig, HHKrämer, OHMahboobi, S A series of novel aryl-methanone derivatives as inhibitors of FMS-like tyrosine kinase 3 (FLT3) in FLT3-ITD-positive acute myeloid leukemia. Eur J Med Chem 193:0 (2020)  
Target
Name:
Receptor-type tyrosine-protein kinase FLT3
Synonyms:
CD135 FL cytokine receptor FLK2 FLT3 Fetal liver kinase-2 Fms-like tyrosine kinase 3 (Flt-3) STK-1 Stem cell tyrosine kinase 1
Type:
Enzyme
Mol. Mass.:
112888.62
Organism:
Homo sapiens (Human)
Description:
P36888
Residue:
993
  
Inhibitor
Name:
BDBM50551648
Synonyms:
CHEMBL4740264
Type:
Small organic molecule
Emp. Form.:
C24H21N5O5
Mol. Mass.:
459.454
SMILES:
CC(C)(C)c1cc(NC(=O)Nc2cc3cc([nH]c3cn2)C(=O)c2cc3cc(O)ccc3o2)no1
: