Target
Ephrin type-A receptor 7
Ligand
BDBM50551644
Substrate
Meas. Tech.
ChEMBL_2032164 (CHEMBL4686322)
EC50
3255±n/a nM
Citation
 Sellmer, APilsl, BBeyer, MPongratz, HWirth, LElz, SDove, SHenninger, SJSpiekermann, KPolzer, HKlaeger, SKuster, BBöhmer, FDFiebig, HHKrämer, OHMahboobi, S A series of novel aryl-methanone derivatives as inhibitors of FMS-like tyrosine kinase 3 (FLT3) in FLT3-ITD-positive acute myeloid leukemia. Eur J Med Chem 193:0 (2020)  
Target
Name:
Ephrin type-A receptor 7
Synonyms:
2.7.10.1 EHK3 EPH homology kinase 3 EPHA7 Ephrin receptor Tyrosine Kinase EPHA6 | Tyrosine Kinase EPHA7
Type:
Mol. Mass.:
112085.32
Organism:
Homo sapiens (Human)
Description:
Residue:
998
  
Inhibitor
Name:
BDBM50551644
Synonyms:
CHEMBL4745937
Type:
Small organic molecule
Emp. Form.:
C25H22N4O5
Mol. Mass.:
458.466
SMILES:
CC(C)(C)c1cc(NC(=O)Nc2ccc3oc(cc3c2)C(=O)c2cc3cc(O)ccc3[nH]2)no1
: