Target
Oxysterols receptor LXR-alpha/Retinoic acid receptor RXR-alpha
Ligand
BDBM19992
Substrate
Meas. Tech.
ChEMBL_2032721 (CHEMBL4686879)
EC50
0.401000±n/a nM
Citation
 Chen, HChen, ZZhang, ZLi, YZhang, SJiang, FWei, JDing, PZhou, HGu, QXu, J Discovery of new LXR? agonists as glioblastoma inhibitors. Eur J Med Chem 194:0 (2020)  
Target
Name:
Oxysterols receptor LXR-alpha/Retinoic acid receptor RXR-alpha
Synonyms:
Retinoic acid receptor RXR-alpha/oxysterols receptor LXR-alpha
Type:
Mol. Mass.:
Description:
ASSAY_ID of ChEMBL is 2032721
Components:
This complex has 2 components.
Component 1
Name:
Retinoic acid receptor RXR-alpha
Synonyms:
NR2B1 Nuclear receptor subfamily 4 group A member 2 RXRA Retinoic acid receptor RXR-alpha/gamma Retinoid receptor
Type:
PROTEIN
Mol. Mass.:
50820.38
Organism:
Homo sapiens (Human)
Description:
ChEMBL_1456363
Residue:
462
  
Component 2
Name:
Oxysterols receptor LXR-alpha
Synonyms:
LXRA Liver X receptor alpha Liver X receptor alpha (NR1H3) NR1H3 Nuclear orphan receptor LXR-alpha | Nuclear receptor subfamily 1 group H member 3
Type:
Enzyme Catalytic Domain
Mol. Mass.:
50403.85
Organism:
Homo sapiens (Human)
Description:
Q13133
Residue:
447
  
Inhibitor
Name:
BDBM19992
Synonyms:
2-[3-[3-[[2-chloro-3-(trifluoromethyl)phenyl]methyl-[2,2-di(phenyl)ethyl]amino]propoxy]phenyl]acetic acid CHEMBL59030 GW3965 US10669296, Compound GW3965 | US10945978, Compound 2
Type:
Small organic molecule
Emp. Form.:
C33H31ClF3NO3
Mol. Mass.:
582.052
SMILES:
OC(=O)Cc1cccc(OCCCN(CC(c2ccccc2)c2ccccc2)Cc2cccc(c2Cl)C(F)(F)F)c1
: