Target
Oxysterols receptor LXR-beta/Retinoic acid receptor RXR-alpha
Ligand
BDBM50551960
Substrate
Meas. Tech.
ChEMBL_2032722 (CHEMBL4686880)
EC50
>10.0±n/a nM
Citation
 Chen, HChen, ZZhang, ZLi, YZhang, SJiang, FWei, JDing, PZhou, HGu, QXu, J Discovery of new LXR? agonists as glioblastoma inhibitors. Eur J Med Chem 194:0 (2020)  
Target
Name:
Oxysterols receptor LXR-beta/Retinoic acid receptor RXR-alpha
Synonyms:
Retinoic acid receptor RXR-alpha/oxysterols receptor LXR-beta
Type:
Mol. Mass.:
Description:
ASSAY_ID of ChEMBL is 2032722
Components:
This complex has 2 components.
Component 1
Name:
Retinoic acid receptor RXR-alpha
Synonyms:
NR2B1 Nuclear receptor subfamily 4 group A member 2 RXRA Retinoic acid receptor RXR-alpha/gamma Retinoid receptor
Type:
PROTEIN
Mol. Mass.:
50820.38
Organism:
Homo sapiens (Human)
Description:
ChEMBL_1456363
Residue:
462
  
Component 2
Name:
Oxysterols receptor LXR-beta
Synonyms:
LXRB Liver X, LXR beta NR1H2 Nuclear receptor NER Ubiquitously-expressed nuclear receptor
Type:
Enzyme Catalytic Domain
Mol. Mass.:
50978.79
Organism:
Homo sapiens (Human)
Description:
P55055
Residue:
460
  
Inhibitor
Name:
BDBM50551960
Synonyms:
CHEMBL4791235
Type:
Small organic molecule
Emp. Form.:
C28H28N2O3
Mol. Mass.:
440.5335
SMILES:
CC(C)(C)OC(=O)N1CC[C@@]2([C@H]1c1cccc(c1)-c1ccccc1)C(=O)Nc1ccccc21
: