Target
Somatostatin receptor type 3
Ligand
BDBM50111536
Substrate
Meas. Tech.
ChEMBL_200691 (CHEMBL807101)
IC50
>100±n/a nM
Citation
 Gazal, SGelerman, GZiv, OKarpov, OLitman, PBracha, MAfargan, MGilon, C Human somatostatin receptor specificity of backbone-cyclic analogues containing novel sulfur building units. J Med Chem 45:1665-71 (2002)  
Target
Name:
Somatostatin receptor type 3
Synonyms:
SOMATOSTATIN SST3 SS3-R SSR-28 SSTR3 | Somatostatin receptor type 3 (SSTR3)
Type:
Protein
Mol. Mass.:
45855.97
Organism:
Homo sapiens (Human)
Description:
P32745
Residue:
418
  
Inhibitor
Name:
BDBM50111536
Synonyms:
2-Amino-N-[13-(4-amino-butyl)-7,22-dibenzyl-5-carbamoylmethyl-10-(1-hydroxy-ethyl)-16,19-bis-(1H-indol-3-ylmethyl)-6,9,12,15,18,21,24-heptaoxo-1,2-dithia-5,8,11,14,17,20,23-heptaaza-cyclohexacos-25-yl]-3-phenyl-propionamide | CHEMBL410205
Type:
Small organic molecule
Emp. Form.:
C66H79N13O10S2
Mol. Mass.:
1278.545
SMILES:
C[C@@H](O)[C@@H]1NC(=O)[C@@H](CCCCN)NC(=O)[C@@H](Cc2c[nH]c3ccccc23)NC(=O)[C@@H](Cc2c[nH]c3ccccc23)NC(=O)[C@H](Cc2ccccc2)NC(=O)C(CSSCCN(CC(N)=O)C(=O)[C@@H](Cc2ccccc2)NC1=O)NC(=O)C(N)Cc1ccccc1
: