Target
Somatostatin receptor type 3
Ligand
BDBM50111537
Substrate
Meas. Tech.
ChEMBL_200691 (CHEMBL807101)
IC50
15.6±n/a nM
Citation
 Gazal, SGelerman, GZiv, OKarpov, OLitman, PBracha, MAfargan, MGilon, C Human somatostatin receptor specificity of backbone-cyclic analogues containing novel sulfur building units. J Med Chem 45:1665-71 (2002)  
Target
Name:
Somatostatin receptor type 3
Synonyms:
SOMATOSTATIN SST3 SS3-R SSR-28 SSTR3 | Somatostatin receptor type 3 (SSTR3)
Type:
Protein
Mol. Mass.:
45855.97
Organism:
Homo sapiens (Human)
Description:
P32745
Residue:
418
  
Inhibitor
Name:
BDBM50111537
Synonyms:
2-[13-(4-Amino-butyl)-7,22-dibenzyl-10-(1-hydroxy-ethyl)-16,19-bis-(1H-indol-3-ylmethyl)-6,9,12,15,18,21,24-heptaoxo-1,2-dithia-5,8,11,14,17,20,23-heptaaza-cyclopentacos-5-yl]-acetamide | CHEMBL408471
Type:
Small organic molecule
Emp. Form.:
C56H67N11O9S2
Mol. Mass.:
1102.329
SMILES:
C[C@@H](O)[C@@H]1NC(=O)[C@@H](CCCCN)NC(=O)[C@@H](Cc2c[nH]c3ccccc23)NC(=O)[C@@H](Cc2c[nH]c3ccccc23)NC(=O)[C@H](Cc2ccccc2)NC(=O)CSSCCN(CC(N)=O)C(=O)[C@@H](Cc2ccccc2)NC1=O
: