Target
E3 ubiquitin-protein ligase Mdm2
Ligand
BDBM50433561
Substrate
Meas. Tech.
ChEMBL_2033595 (CHEMBL4687753)
Ki
0.880000±n/a nM
Citation
 Talele, TT Opportunities for Tapping into Three-Dimensional Chemical Space through a Quaternary Carbon. J Med Chem 63:13291-13315 (2020)  
Target
Name:
E3 ubiquitin-protein ligase Mdm2
Synonyms:
Double minute 2 protein E3 ubiquitin-protein ligase Mdm2 (p53-binding protein Mdm2) Human Double Minute 2 (HDM2) MDM2-MDMX p53-Binding Protein MDM2 | p53-binding protein
Type:
Oncoprotein
Mol. Mass.:
55196.54
Organism:
Homo sapiens (Human)
Description:
Q00987
Residue:
491
  
Inhibitor
Name:
BDBM50433561
Synonyms:
CHEMBL2381408
Type:
Small organic molecule
Emp. Form.:
C29H34Cl2FN3O3
Mol. Mass.:
562.503
SMILES:
CC(C)(C)C[C@@H]1N[C@H]([C@H](c2cccc(Cl)c2F)[C@]11C(=O)Nc2cc(Cl)ccc12)C(=O)N[C@H]1CC[C@H](O)CC1
: