Target
Adenosine kinase
Ligand
BDBM50090847
Substrate
Meas. Tech.
ChEMBL_31119 (CHEMBL643547)
IC50
40±n/a nM
Citation
 Srikanth, KDebnath, BJha, T QSAR study on adenosine kinase inhibition of pyrrolo[2,3-d]pyrimidine nucleoside analogues using the hansch approach. Bioorg Med Chem Lett 12:899-902 (2002)  
Target
Name:
Adenosine kinase
Synonyms:
ADK | ADK_HUMAN
Type:
PROTEIN
Mol. Mass.:
40545.97
Organism:
Homo sapiens (Human)
Description:
ChEMBL_1467841
Residue:
362
  
Inhibitor
Name:
BDBM50090847
Synonyms:
(2R,3R,4S,5R)-2-(4-Amino-5-bromo-pyrrolo[2,3-d]pyrimidin-7-yl)-5-methyl-tetrahydro-furan-3,4-diol 2-(4-Amino-5-bromo-pyrrolo[2,3-d]pyrimidin-7-yl)-5-methyl-tetrahydro-furan-3,4-diol | CHEMBL98909
Type:
Small organic molecule
Emp. Form.:
C11H13BrN4O3
Mol. Mass.:
329.15
SMILES:
C[C@H]1O[C@H]([C@H](O)[C@@H]1O)n1cc(Br)c2c(N)ncnc12
: