Target
Adenosine kinase
Ligand
BDBM50049823
Substrate
Meas. Tech.
ChEMBL_31119 (CHEMBL643547)
IC50
310±n/a nM
Citation
 Srikanth, KDebnath, BJha, T QSAR study on adenosine kinase inhibition of pyrrolo[2,3-d]pyrimidine nucleoside analogues using the hansch approach. Bioorg Med Chem Lett 12:899-902 (2002)  
Target
Name:
Adenosine kinase
Synonyms:
ADK | ADK_HUMAN
Type:
PROTEIN
Mol. Mass.:
40545.97
Organism:
Homo sapiens (Human)
Description:
ChEMBL_1467841
Residue:
362
  
Inhibitor
Name:
BDBM50049823
Synonyms:
4-Amino-7-((2R,3R,4S,5R)-3,4-dihydroxy-5-hydroxymethyl-tetrahydro-furan-2-yl)-7H-pyrrolo[2,3-d]pyrimidine-5-carbonitrile 4-Amino-7-(3,4-dihydroxy-5-hydroxymethyl-tetrahydro-furan-2-yl)-7H-pyrrolo[2,3-d]pyrimidine-5-carbonitrile(toyocamycin) Ara-toyocamycine TOYOCAMYCIN cid_247955
Type:
Small organic molecule
Emp. Form.:
C12H13N5O4
Mol. Mass.:
291.2627
SMILES:
Nc1ncnc2n(cc(C#N)c12)[C@@H]1O[C@H](CO)[C@@H](O)[C@H]1O
: