Target
Adenosine kinase
Ligand
BDBM50090836
Substrate
Meas. Tech.
ChEMBL_31119 (CHEMBL643547)
IC50
460±n/a nM
Citation
 Srikanth, KDebnath, BJha, T QSAR study on adenosine kinase inhibition of pyrrolo[2,3-d]pyrimidine nucleoside analogues using the hansch approach. Bioorg Med Chem Lett 12:899-902 (2002)  
Target
Name:
Adenosine kinase
Synonyms:
ADK | ADK_HUMAN
Type:
PROTEIN
Mol. Mass.:
40545.97
Organism:
Homo sapiens (Human)
Description:
ChEMBL_1467841
Residue:
362
  
Inhibitor
Name:
BDBM50090836
Synonyms:
4-Amino-7-((2R,3R,4S,5R)-3,4-dihydroxy-5-methyl-tetrahydro-furan-2-yl)-7H-pyrrolo[2,3-d]pyrimidine-5-carboxylic acid amide 4-amino-7-((2R,3R,4S,5R)-3,4-dihydroxy-5-methyl-tetrahydrofuran-2-yl)-7H-pyrrolo[2,3-d]pyrimidine-5-carboxamide | CHEMBL98638
Type:
Small organic molecule
Emp. Form.:
C12H15N5O4
Mol. Mass.:
293.2786
SMILES:
C[C@H]1O[C@H]([C@H](O)[C@@H]1O)n1cc(C(N)=O)c2c(N)ncnc12
: