Target
Sphingosine kinase 2
Ligand
BDBM50552497
Substrate
Meas. Tech.
ChEMBL_2034879 (CHEMBL4689037)
Ki
951±n/a nM
Citation
 Li, HSibley, CDKharel, YHuang, TBrown, AMWonilowicz, LGBevan, DRLynch, KRSantos, WL Lipophilic tail modifications of 2-(hydroxymethyl)pyrrolidine scaffold reveal dual sphingosine kinase 1 and 2 inhibitors. Bioorg Med Chem 30:0 (2021)  
Target
Name:
Sphingosine kinase 2
Synonyms:
SK 2 SPHK2 SPK 2 Sphingosine kinase types 2 (SphK2)
Type:
Protein
Mol. Mass.:
69221.44
Organism:
Homo sapiens (Human)
Description:
Q9NRA0
Residue:
654
  
Inhibitor
Name:
BDBM50552497
Synonyms:
CHEMBL4763909
Type:
Small organic molecule
Emp. Form.:
C24H42ClNO
Mol. Mass.:
396.049
SMILES:
Cl.CCCCCCCCCCCCc1ccc(CN2CCC[C@@H]2CO)cc1
: