Target
Sphingosine kinase 2
Ligand
BDBM50552501
Substrate
Meas. Tech.
ChEMBL_2034879 (CHEMBL4689037)
Ki
400±n/a nM
Citation
 Li, HSibley, CDKharel, YHuang, TBrown, AMWonilowicz, LGBevan, DRLynch, KRSantos, WL Lipophilic tail modifications of 2-(hydroxymethyl)pyrrolidine scaffold reveal dual sphingosine kinase 1 and 2 inhibitors. Bioorg Med Chem 30:0 (2021)  
Target
Name:
Sphingosine kinase 2
Synonyms:
SK 2 SPHK2 SPK 2 Sphingosine kinase types 2 (SphK2)
Type:
Protein
Mol. Mass.:
69221.44
Organism:
Homo sapiens (Human)
Description:
Q9NRA0
Residue:
654
  
Inhibitor
Name:
BDBM50552501
Synonyms:
CHEMBL4799862
Type:
Small organic molecule
Emp. Form.:
C29H37ClF3N5O3
Mol. Mass.:
596.084
SMILES:
Cl.CCCCCCCCOc1ccc(COc2ccc(cc2C(F)(F)F)-c2noc(n2)[C@@H]2CCCN2C(N)=N)cc1
: