Target
Protein farnesyltransferase subunit beta/geranylgeranyltransferase type-1 subunit alpha
Ligand
BDBM50112383
Substrate
Meas. Tech.
ChEMBL_70146 (CHEMBL685969)
IC50
0.480000±n/a nM
Citation
 Nguyen, DNStump, CAWalsh, ESFernandes, CDavide, JPEllis-Hutchings, MRobinson, RGWilliams, TMLobell, RBHuber, HEBuser, CA Potent inhibitors of farnesyltransferase and geranylgeranyltransferase-I. Bioorg Med Chem Lett 12:1269-73 (2002)  
Target
Name:
Protein farnesyltransferase subunit beta/geranylgeranyltransferase type-1 subunit alpha
Synonyms:
Protein Farnesyltransferase (PFT) | Protein farnesyltransferase
Type:
Protein Complex
Mol. Mass.:
Description:
Purified bovine brain FTase.
Components:
This complex has 2 components.
Component 1
Name:
Protein farnesyltransferase/geranylgeranyltransferase type-1 subunit alpha
Synonyms:
CAAX farnesyltransferase alpha subunit FNTA_BOVIN GGTase-I-alpha Protein Farnesyltransferase (PFT) Chain A Protein farnesyltransferase/geranylgeranyltransferase type I alpha subunit Type I protein geranyl-geranyltransferase alpha subunit
Type:
Enzyme
Mol. Mass.:
43827.38
Organism:
Bos taurus (bovine)
Description:
The enzyme was purified from a bovine brain homogenate by sequential ammonium sulfate fractionation and affinity chromatography.
Residue:
375
  
Component 2
Name:
Protein farnesyltransferase subunit beta
Synonyms:
CAAX farnesyltransferase subunit beta FNTB_BOVIN Protein farnesyltransferase Protein farnesyltransferase subunit beta Ras proteins prenyltransferase subunit beta
Type:
Enzyme Subunit
Mol. Mass.:
48758.49
Organism:
Bos taurus (bovine)
Description:
Protein farnesyltransferase subunit beta
Residue:
437
  
Inhibitor
Name:
BDBM50112383
Synonyms:
17-(5,5,5-trifluoropentyl)-19-oxa-2,5,10,12-tetraazahexacyclo[18.6.2.22,5.114,18.08,12.023,27]hentriaconta-1(27),8,10,14(31),15,17,20(28),21,23,25-decaen-3-one | CHEMBL23650
Type:
Small organic molecule
Emp. Form.:
C31H31F3N4O2
Mol. Mass.:
548.5986
SMILES:
FC(F)(F)CCCCc1ccc2Cn3cncc3CCN3CCN(C(=O)C3)c3cccc4ccc(Oc1c2)cc34
: