Target
Prostaglandin G/H synthase 1
Ligand
BDBM22953
Substrate
Meas. Tech.
ChEBML_159409
IC50
>66000±n/a nM
Citation
 Kozak, KRPrusakiewicz, JJRowlinson, SWMarnett, LJ Enantiospecific, selective cyclooxygenase-2 inhibitors. Bioorg Med Chem Lett 12:1315-8 (2002)  
Target
Name:
Prostaglandin G/H synthase 1
Synonyms:
COX1 Cyclooxygenase-1 (COX-1) PTGS1 | Prostaglandin G/H synthase (cyclooxygenase)
Type:
Protein
Mol. Mass.:
68868.60
Organism:
Ovis aries (Sheep)
Description:
Residue:
600
  
Inhibitor
Name:
BDBM22953
Synonyms:
2-{1-[(4-chlorophenyl)carbonyl]-5-methoxy-2-methyl-1H-indol-3-yl}-N-(2-hydroxyethyl)acetamide Indomethacin derivative, 6
Type:
Small organic molecule
Emp. Form.:
C21H21ClN2O4
Mol. Mass.:
400.855
SMILES:
COc1ccc2n(C(=O)c3ccc(Cl)cc3)c(C)c(CC(=O)NCCO)c2c1
: