Target
Endoplasmin
Ligand
BDBM50552886
Substrate
Meas. Tech.
ChEMBL_2035398 (CHEMBL4689556)
Ki
>10000±n/a nM
Citation
 Tosh, DKBrackett, CMJung, YHGao, ZGBanerjee, MBlagg, BSJJacobson, KA Biological Evaluation of 5'-( ACS Med Chem Lett 12:373-379 (2021)  
Target
Name:
Endoplasmin
Synonyms:
94 kDa glucose-regulated protein GRP-94 Glucose regulated protein 94kDa (Grp94) Heat shock protein 90 kDa beta member 1 Tumor rejection antigen 1 | gp96 homolog
Type:
Protein
Mol. Mass.:
92417.36
Organism:
Homo sapiens (Human)
Description:
P14625
Residue:
803
  
Inhibitor
Name:
BDBM50552886
Synonyms:
CHEMBL4762917
Type:
Small organic molecule
Emp. Form.:
C16H16N6O5
Mol. Mass.:
372.3354
SMILES:
Nc1ncnc2n(cnc12)[C@@H]1O[C@H](COC(=O)c2cccnc2)[C@@H](O)[C@H]1O
: