Target
Endoplasmin
Ligand
BDBM50552894
Substrate
Meas. Tech.
ChEMBL_2035398 (CHEMBL4689556)
Ki
10000±n/a nM
Citation
 Tosh, DKBrackett, CMJung, YHGao, ZGBanerjee, MBlagg, BSJJacobson, KA Biological Evaluation of 5'-( ACS Med Chem Lett 12:373-379 (2021)  
Target
Name:
Endoplasmin
Synonyms:
94 kDa glucose-regulated protein GRP-94 Glucose regulated protein 94kDa (Grp94) Heat shock protein 90 kDa beta member 1 Tumor rejection antigen 1 | gp96 homolog
Type:
Protein
Mol. Mass.:
92417.36
Organism:
Homo sapiens (Human)
Description:
P14625
Residue:
803
  
Inhibitor
Name:
BDBM50552894
Synonyms:
CHEMBL4759912
Type:
Small organic molecule
Emp. Form.:
C12H15N7O5
Mol. Mass.:
337.2914
SMILES:
NC(=O)CNC(=O)[C@H]1O[C@H]([C@H](O)[C@@H]1O)n1cnc2c(N)ncnc12
: