Target
Prostaglandin E2 receptor EP3 subtype
Ligand
BDBM50384443
Substrate
Meas. Tech.
ChEMBL_2035620 (CHEMBL4689778)
IC50
68±n/a nM
Citation
 Zhang, XZhu, BGuo, LBakaj, IRankin, MHo, GKauffman, JLee, SPNorquay, LMacielag, MJ Discovery of a Novel Series of Pyridone-Based EP3 Antagonists for the Treatment of Type 2 Diabetes. ACS Med Chem Lett 12:451-458 (2021)  
Target
Name:
Prostaglandin E2 receptor EP3 subtype
Synonyms:
PE2R3_HUMAN PGE2-R Prostaglandin E2 receptor Prostaglandin E2 receptor EP3 subtype (EP3) Prostaglandin E2 receptor EP3D subtype (EP3D) | Prostanoid EP3 receptor
Type:
Enzyme
Mol. Mass.:
43335.03
Organism:
Homo sapiens (Human)
Description:
P43115
Residue:
390
  
Inhibitor
Name:
BDBM50384443
Synonyms:
CHEMBL1770317
Type:
Small organic molecule
Emp. Form.:
C21H18N2O4
Mol. Mass.:
362.3786
SMILES:
CC(C)C1(OC(O)=NC1=O)c1ccc([nH]c1=O)-c1ccc2ccccc2c1
: