Target
Adenosine receptor A2b
Ligand
BDBM50001493
Substrate
Meas. Tech.
ChEMBL_30305 (CHEMBL636450)
Ki
4730.0±n/a nM
Citation
 Kim, SAMarshall, MAMelman, NKim, HSMüller, CELinden, JJacobson, KA Structure-activity relationships at human and rat A2B adenosine receptors of xanthine derivatives substituted at the 1-, 3-, 7-, and 8-positions. J Med Chem 45:2131-8 (2002)  
Target
Name:
Adenosine receptor A2b
Synonyms:
AA2BR_HUMAN ADORA2B Adenosine receptors A2b | Adenosine receptors; A2a & A2b
Type:
G Protein-Coupled Receptor (GPCR)
Mol. Mass.:
36341.22
Organism:
Homo sapiens (Human)
Description:
Residue:
332
  
Inhibitor
Name:
BDBM50001493
Synonyms:
3-Propyl-3,7-dihydro-purine-2,6-dione 3-Propylxanthine (enprofylline) ENPROFYLLINE
Type:
Small organic molecule
Emp. Form.:
C8H10N4O2
Mol. Mass.:
194.1906
SMILES:
CCCn1c2nc[nH]c2c(=O)[nH]c1=O
: