Target
Arginase-1
Ligand
BDBM50045936
Substrate
Meas. Tech.
ChEMBL_2045307 (CHEMBL4700006)
Ki
136000±n/a nM
Citation
 Muller, JCardey, BZedet, ADesingle, CGrzybowski, MPomper, PFoley, SHarakat, DRamseyer, CGirard, CPudlo, M Synthesis, evaluation and molecular modelling of piceatannol analogues as arginase inhibitors. RSC Med Chem 11:559-568 (2020)  
Target
Name:
Arginase-1
Synonyms:
ARG1 Liver-type arginase | Type I arginase
Type:
PROTEIN
Mol. Mass.:
35008.90
Organism:
Bos taurus
Description:
ChEMBL_474406
Residue:
322
  
Inhibitor
Name:
BDBM50045936
Synonyms:
(E)-4-(3,5-dihydroxystyryl)benzene-1,2-diol 3,3',4,5'-tetrahydroxystilbene 3,4,3',5'-tetrahydroxystillbene 4-[(E)-2-(3,5-dihydroxyphenyl)vinyl]benzene-1,2-diol 4-[2-(3,5-dihydroxyphenyl)-(E)-1-ethenyl]-1,2-benzenediol CHEMBL69863 US11866416, Example 8 piceatanol | trans-3,3',4,5'-tetrahydroxystilbene
Type:
Small organic molecule
Emp. Form.:
C14H12O4
Mol. Mass.:
244.2427
SMILES:
Oc1cc(O)cc(\C=C\c2ccc(O)c(O)c2)c1
: