Target
Methionine--tRNA ligase, mitochondrial
Ligand
BDBM50553188
Substrate
Meas. Tech.
ChEMBL_2045379 (CHEMBL4700078)
EC50
39±n/a nM
Citation
 Zhang, ZBarros-Álvarez, XGillespie, JRRanade, RMHuang, WShibata, SMolasky, NMRFaghih, OMushtaq, AChoy, RKMde Hostos, EHol, WGJVerlinde, CLMJBuckner, FSFan, E Structure-guided discovery of selective methionyl-tRNA synthetase inhibitors with potent activity against  RSC Med Chem 11:885-895 (2020)  
Target
Name:
Methionine--tRNA ligase, mitochondrial
Synonyms:
6.1.1.10 Methionine--tRNA ligase, mitochondrial Mitochondrial methionyl-tRNA synthetase SYMM_HUMAN
Type:
PROTEIN
Mol. Mass.:
66605.24
Organism:
Homo sapiens
Description:
ChEMBL_120165
Residue:
593
  
Inhibitor
Name:
BDBM50553188
Synonyms:
CHEMBL4757779
Type:
Small organic molecule
Emp. Form.:
C20H19Cl2N5O2
Mol. Mass.:
432.303
SMILES:
CCn1c(Cc2ccc(OC)cc2Cl)cn(Cc2nc3nc(Cl)ccc3[nH]2)c1=O
: