Target
Methionine--tRNA ligase, mitochondrial
Ligand
BDBM50553192
Substrate
Meas. Tech.
ChEMBL_2045379 (CHEMBL4700078)
EC50
1750±n/a nM
Citation
 Zhang, ZBarros-Álvarez, XGillespie, JRRanade, RMHuang, WShibata, SMolasky, NMRFaghih, OMushtaq, AChoy, RKMde Hostos, EHol, WGJVerlinde, CLMJBuckner, FSFan, E Structure-guided discovery of selective methionyl-tRNA synthetase inhibitors with potent activity against  RSC Med Chem 11:885-895 (2020)  
Target
Name:
Methionine--tRNA ligase, mitochondrial
Synonyms:
6.1.1.10 Methionine--tRNA ligase, mitochondrial Mitochondrial methionyl-tRNA synthetase SYMM_HUMAN
Type:
PROTEIN
Mol. Mass.:
66605.24
Organism:
Homo sapiens
Description:
ChEMBL_120165
Residue:
593
  
Inhibitor
Name:
BDBM50553192
Synonyms:
CHEMBL4750041
Type:
Small organic molecule
Emp. Form.:
C21H14Cl2FN5O
Mol. Mass.:
442.273
SMILES:
COc1cc(c(Cl)cc1Cl)-c1cccc2nc(Cc3nc4nc(F)ccc4[nH]3)cn12
: