Target
Solute carrier organic anion transporter family member 1B1
Ligand
BDBM50458163
Substrate
Meas. Tech.
ChEMBL_2046080 (CHEMBL4700779)
IC50
66±n/a nM
Citation
 Boy, KMGuernon, JMZuev, DSXu, LZhang, YShi, JMarcin, LRHiggins, MAWu, YJKrishnananthan, SLi, JTrehan, ASmith, DToyn, JHMeredith, JEBurton, CRKimura, SRZvyaga, TZhuo, XLentz, KAGrace, JEDenton, RMorrison, JSMathur, AAlbright, CFAhlijanian, MKOlson, REThompson, LAMacor, JE Identification and Preclinical Evaluation of the Bicyclic Pyrimidine ?-Secretase Modulator BMS-932481. ACS Med Chem Lett 10:312-317 (2019)  
Target
Name:
Solute carrier organic anion transporter family member 1B1
Synonyms:
LST1 OATP2 SLC21A6 SO1B1_HUMAN Solute carrier organic anion transporter family member 1B1 (OATP1B1) | Thromboxane B2
Type:
Protein
Mol. Mass.:
76468.06
Organism:
Homo sapiens (Human)
Description:
Q9Y6L6
Residue:
691
  
Inhibitor
Name:
BDBM50458163
Synonyms:
CHEMBL4209316
Type:
Small organic molecule
Emp. Form.:
C24H24FN7O
Mol. Mass.:
445.4921
SMILES:
CNc1nc(Nc2ccc(c(OC)c2)-n2cnc(C)n2)nc2[C@@H](CCc12)c1ccc(F)cc1
: