Target
Cytochrome P450 1A2
Ligand
BDBM50458163
Substrate
Meas. Tech.
ChEMBL_2046109 (CHEMBL4700808)
IC50
>40000±n/a nM
Citation
 Boy, KMGuernon, JMZuev, DSXu, LZhang, YShi, JMarcin, LRHiggins, MAWu, YJKrishnananthan, SLi, JTrehan, ASmith, DToyn, JHMeredith, JEBurton, CRKimura, SRZvyaga, TZhuo, XLentz, KAGrace, JEDenton, RMorrison, JSMathur, AAlbright, CFAhlijanian, MKOlson, REThompson, LAMacor, JE Identification and Preclinical Evaluation of the Bicyclic Pyrimidine ?-Secretase Modulator BMS-932481. ACS Med Chem Lett 10:312-317 (2019)  
Target
Name:
Cytochrome P450 1A2
Synonyms:
CP1A2_HUMAN CYPIA2 Cytochrome P(3)450 Cytochrome P450 1A2 (CYP1A2) Cytochrome P450-P3
Type:
Enzyme
Mol. Mass.:
58423.38
Organism:
Homo sapiens (Human)
Description:
P05177
Residue:
516
  
Inhibitor
Name:
BDBM50458163
Synonyms:
CHEMBL4209316
Type:
Small organic molecule
Emp. Form.:
C24H24FN7O
Mol. Mass.:
445.4921
SMILES:
CNc1nc(Nc2ccc(c(OC)c2)-n2cnc(C)n2)nc2[C@@H](CCc12)c1ccc(F)cc1
: