Target
Cytochrome P450 2C19
Ligand
BDBM50458163
Substrate
Meas. Tech.
ChEMBL_2046113 (CHEMBL4700812)
IC50
8300±n/a nM
Citation
 Boy, KMGuernon, JMZuev, DSXu, LZhang, YShi, JMarcin, LRHiggins, MAWu, YJKrishnananthan, SLi, JTrehan, ASmith, DToyn, JHMeredith, JEBurton, CRKimura, SRZvyaga, TZhuo, XLentz, KAGrace, JEDenton, RMorrison, JSMathur, AAlbright, CFAhlijanian, MKOlson, REThompson, LAMacor, JE Identification and Preclinical Evaluation of the Bicyclic Pyrimidine ?-Secretase Modulator BMS-932481. ACS Med Chem Lett 10:312-317 (2019)  
Target
Name:
Cytochrome P450 2C19
Synonyms:
(R)-limonene 6-monooxygenase (S)-limonene 7-monooxygenase CYP2C19 CYPIIC19 Cytochrome P450 2C19 [I331V] Cytochrome P450-254C Mephenytoin 4-hydroxylase P450-254C
Type:
Enzyme
Mol. Mass.:
55935.47
Organism:
Homo sapiens (Human)
Description:
P33261
Residue:
490
  
Inhibitor
Name:
BDBM50458163
Synonyms:
CHEMBL4209316
Type:
Small organic molecule
Emp. Form.:
C24H24FN7O
Mol. Mass.:
445.4921
SMILES:
CNc1nc(Nc2ccc(c(OC)c2)-n2cnc(C)n2)nc2[C@@H](CCc12)c1ccc(F)cc1
: