Target
Cytochrome P450 3A4
Ligand
BDBM50458163
Substrate
Meas. Tech.
ChEMBL_2046115 (CHEMBL4700814)
IC50
200±n/a nM
Citation
 Boy, KMGuernon, JMZuev, DSXu, LZhang, YShi, JMarcin, LRHiggins, MAWu, YJKrishnananthan, SLi, JTrehan, ASmith, DToyn, JHMeredith, JEBurton, CRKimura, SRZvyaga, TZhuo, XLentz, KAGrace, JEDenton, RMorrison, JSMathur, AAlbright, CFAhlijanian, MKOlson, REThompson, LAMacor, JE Identification and Preclinical Evaluation of the Bicyclic Pyrimidine ?-Secretase Modulator BMS-932481. ACS Med Chem Lett 10:312-317 (2019)  
Target
Name:
Cytochrome P450 3A4
Synonyms:
Albendazole monooxygenase CP3A4_HUMAN CYP3A4 CYPIIIA4 Cytochrome P450 3A4 (CYP3A4) Nifedipine oxidase Taurochenodeoxycholate 6-alpha-hydroxylase
Type:
Enzyme
Mol. Mass.:
57349.57
Organism:
Homo sapiens (Human)
Description:
Residue:
503
  
Inhibitor
Name:
BDBM50458163
Synonyms:
CHEMBL4209316
Type:
Small organic molecule
Emp. Form.:
C24H24FN7O
Mol. Mass.:
445.4921
SMILES:
CNc1nc(Nc2ccc(c(OC)c2)-n2cnc(C)n2)nc2[C@@H](CCc12)c1ccc(F)cc1
: